{"text_format":"3","workbook":"xlsx","n_sheets":6,"sheets":["How to use","Risk Level Scores","Mapping Tool Search","Mapping Tool Data","Mapping Tool Data High Level","Factors & Assumptions"],"not_rendered":{"images":5,"defined_names":1},"read":"whole","date_system":"1900"}

{"sheet":"How to use","index":0,"n_rows":27,"n_cols":3,"rows_kept":27,"merged":[[1,1,1,3],[3,2,3,3],[4,2,4,3],[5,2,5,3],[6,1,6,3],[7,1,8,1],[7,2,7,3],[9,1,12,1],[9,2,9,3],[13,2,13,3],[14,1,15,1],[14,2,14,3],[16,1,22,1],[16,2,16,3],[23,2,23,3],[24,1,24,3],[25,1,26,1],[25,2,25,3],[26,2,26,3]]}
[]
[null," UKUPC Responsible Procurement Commodity Mapping Tool"]
[]
[null,"Overview","The UKUPC Responsible Procurement Commodity Mapping Tool is used to identify thematic areas which should be considered in procurement of the category in question. It has been developed by members of the EAUC & HEPA Responsible Procurement Group (RPG) & UKUPC Responsible Procurement Network.\n\nThe sustainability themes mapped align to the themes set out in the Sustain Supply Chain Code of Conduct (2021b)\n\nNote: The information contained in the tool is an indicative assessment of risks at ProcHE level 2 and may not capture the complexities of certain risks specific to your requirements.  As such users should apply their knowledge and experience when interpreting the allocated scores in the specific context of the procurement, supported by dialogue with internal stakeholders and the market to identify how to manage the specific risks and maximise opportunities. Specific attention needs to be given to issues presenting as N/A where risk is unknown."]
[null,"Contact","For further details on this mapping tool, please contact:                                                                "]
[null,"Version","This is version 1.0, released in August 2025.\n\nThe mapping tool will be reviewed in line with updates to the Sustain Supply Chain Code of Conduct."]
[null,"Using the Tool"]
[null,"Input","Select the PROC-HE2 commodity code / description within the \"Mapping Tool Search\" Tab (cells E6 OR E9). "]
[]
[null,"Establishing PROC-HE2 Code","Hints & Tips: One method for establishing the PROC-HE2 code is through Hunter."]
[]
[]
[]
[null,"How the Outputs have been developed","These scores have been developed by RPG representatives, or colleagues from RPG institutions who have specific expertise in these themes. Additional details on the assumptions made are available on the \"Factors & Assumptions \"tab."]
[null,"Outputs","Once a specific PROC-HE2 code or description is selected, the output table on the right hand side of the \"Mapping Tool Search\" will populate with the associated risk or opportunity level.\n"]
{"$rows_left_out":13}
{"sheet":"Risk Level Scores","index":1,"n_rows":310,"n_cols":10,"rows_kept":310,"hidden":true,"merged":[[12,1,15,1]]}
[{"$nulls":8},1,2]
[{"$nulls":8},"Com Code","Commodity Code Description"]
[{"$nulls":8},"AA","Audio Visual Equipment, incl video conferencing, Televisions, Videos, sound recorders"]
[null,null,"Min Score","Max Score",{"$nulls":4},"AC","Audio Visual Learning and Training  Packs and Pre-recorded  Media"]
[null,"Low",{"$f":"'Mapping Tool Search'!S18","v":{"v":0.1,"d":"0"}},{"$f":"'Mapping Tool Search'!T18","v":{"v":15.99999999,"d":"16"}},"Low",{"$nulls":3},"AD","Musical Instruments, Purchase, Maintenance and Hire"]
[null,"Medium",{"$f":"'Mapping Tool Search'!S19","v":16},{"$f":"'Mapping Tool Search'!T19","v":{"v":27.99999999,"d":"28"}},"Medium",{"$nulls":3},"AE","Photographic Equipment Supplies and Services"]
[null,"High",{"$f":"'Mapping Tool Search'!S20","v":28},{"$f":"'Mapping Tool Search'!T20","v":{"v":34.99999999,"d":"35"}},"High",{"$nulls":3},"AF","Studio Hire and Running  Costs"]
[null,"Very high",{"$f":"'Mapping Tool Search'!S21","v":35},{"$f":"'Mapping Tool Search'!T21","v":48},"Very high",{"$nulls":3},"AG","Theatre Production Costs (scenery, lighting, props, costumes)"]
[{"$nulls":8},"AH","Video Equipment Purchase hire and Maintenance and repair "]
[null,"Notes",{"$nulls":6},"AJ","Audio Visual Consumables,  Accessories, Cassettes  etc"]
[null,"Only change cells coloured GREEN",{"$nulls":6},"AL","Digital Imaging Equipment  Purchase, Maintenance,  Repair and Consumables"]
[null,"Do not edit cells coloured RED",{"$nulls":6},"AT","Audio-Visual Equipment Hire"]
[null,"These are reflected in the Cell \"Commodity Risk / Opportunity Classification\" in the Risk and Opportunity Search\" Function",{"$nulls":6},"AU","Audio Visual Equipment Maintenance and Services"]
[{"$nulls":8},"AZ","Other and General Audio-Visual  Aids"]
[{"$nulls":8},"BA","Book Binding Services"]
{"$rows_left_out":296}
{"sheet":"Mapping Tool Search","index":2,"n_rows":24,"n_cols":20,"rows_kept":24,"merged":[[0,1,0,7],[1,11,1,19],[2,3,2,4],[2,12,2,19],[3,3,3,4],[5,3,5,4],[7,12,7,14],[7,15,7,16],[7,17,7,19],[9,1,10,7],[14,17,15,19],[16,12,16,15],[17,12,17,13],[17,14,17,15],[18,12,18,13],[18,14,18,15],[19,12,19,13],[19,14,19,15],[20,12,20,13],[20,14,20,15],[21,12,21,13],[21,14,21,15],[23,18,23,19]]}
[null,"Risk & Opportunity Matrix Search"]
[{"$nulls":11},"OUTPUT - DO NOT ALTER"]
[{"$nulls":3},"INPUT HERE",{"$nulls":8},"Environmental Sustainability"]
[{"$nulls":3},"SELECT FROM DROP DOWN (one of these boxes should be blank when searching)",{"$nulls":7},"Max Environment Score","Carbon / Climate Change ","Biodiversity "," Water Use","Novel entities (e.g. chemical pollution and microplastics) ","Material scarcity & security ","Waste/ Disposal ","Circular Economy Opportunities","Environmental Data Maturity Opportunities"]
[{"$nulls":3},"Proc HE2 code:",null,{"$f":"IF(E5=\"\",VLOOKUP(E8,'Mapping Tool Data'!AE:AF,2),E5)","v":{"$error":"#N/A"}},{"$nulls":5},{"$f":"IFERROR(VLOOKUP($F$5,'Mapping Tool Data'!$A:$N,#REF!),\"\")","v":""},{"$f":"IFERROR(VLOOKUP($F$5,'Mapping Tool Data'!$A4:$V333,4),\"\")","v":""},{"$f":"IFERROR(VLOOKUP($F$5,'Mapping Tool Data'!$A4:$V333,5),\"\")","v":""},{"$f":"IFERROR(VLOOKUP($F$5,'Mapping Tool Data'!$A4:$WO333,6),\"\")","v":""},{"$f":"IFERROR(VLOOKUP($F$5,'Mapping Tool Data'!$A4:$V333,7),\"\")","v":""},{"$f":"IFERROR(VLOOKUP($F$5,'Mapping Tool Data'!$A4:$V333,8),\"\")","v":""},{"$f":"IFERROR(VLOOKUP($F$5,'Mapping Tool Data'!$A4:$V333,9),\"\")","v":""},{"$f":"IFERROR(VLOOKUP($F$5,'Mapping Tool Data'!$A4:$V333,10),\"\")","v":""},{"$f":"IFERROR(VLOOKUP($F$5,'Mapping Tool Data'!$A4:$V333,11),\"\")","v":""}]
[{"$nulls":3},"OR "]
[{"$nulls":11},12,13,14,15,16,18,19,21,22]
[{"$nulls":3},"Proc HE2 Description:",{"$nulls":8},"Social Compliance",null,null,"Working Environment and Terms",null,"Ethical Compliance & Economic Development"]
[{"$nulls":12}," Equality "," Modern Slavery Risk ","Social Opportunities (local)","Wages and Terms","Health and Safety","Bribery & Corruption ","GDPR ","Cyber Security "]
[null,"Use the Contract management section within Hunter to establish the Proc-HE2 code / description",{"$nulls":10},{"$f":"IFERROR(VLOOKUP($F$5,'Mapping Tool Data'!$A4:$V333,13),\"\")","v":""},{"$f":"IFERROR(VLOOKUP($F$5,'Mapping Tool Data'!$A4:$V333,14),\"\")","v":""},{"$f":"IFERROR(VLOOKUP($F$5,'Mapping Tool Data'!$A4:$V333,15),\"\")","v":""},{"$f":"IFERROR(VLOOKUP($F$5,'Mapping Tool Data'!$A4:$V333,17),\"\")","v":""},{"$f":"IFERROR(VLOOKUP($F$5,'Mapping Tool Data'!$A4:$V333,18),\"\")","v":""},{"$f":"IFERROR(VLOOKUP($F$5,'Mapping Tool Data'!$A4:$V333,20),\"\")","v":""},{"$f":"IFERROR(VLOOKUP($F$5,'Mapping Tool Data'!$A4:$V333,21),\"\")","v":""},{"$f":"IFERROR(VLOOKUP($F$5,'Mapping Tool Data'!$A4:$V333,22),\"\")","v":""}]
[]
[{"$nulls":12},"Total Score (Max = 48)",{"$f":"SUM(M5:T5)+SUM(M10:Q10)","v":0},null,"Number of High score themes (3)",{"$f":"COUNTIF(M5:T11,3)","v":0},null,"Commodity Risk / Opportunity Classification",{"$f":"IFERROR(VLOOKUP(N12,'Risk Level Scores'!$C$5:$E$8,3),\"\")","v":""}]
[]
[]
[{"$nulls":17},"Commodity Risk / Opportunity Classification"]
{"$rows_left_out":10}
{"sheet":"Mapping Tool Data","index":3,"n_rows":333,"n_cols":32,"rows_kept":333}
[1,2,3,4,5,6,7,8,9,10,11,null,12,14,17,null,15,16,{"$nulls":7},"AC",{"$nulls":5},"Supply Chain Code of Conduct Principle:"]
["Com Code","Commodity Code Description","Environmental Sustainability MAX","Carbon/ Climate Change ","Biodiversity "," Water ","Novel entities ","Material scarcity & security ","Waste/ Disposal ","Circular Economy Opportunities","Environmental Data Maturity Opportunities"," Social Compliance MAX"," Equality "," Modern Slavery Risk ","Social Opportunities (local)","Working Environment and Terms MAX","Wages and Terms","Health and Safety","Ethical Compliance & Economic Development MAX","Bribery & Corruption ","GDPR ","Cyber Security ","Sum",null,null,"AD",{"$nulls":4},"Commodity Code Description","Com Code"]
["A","Audio-Visual & Multimedia Supplies and Services",{"$nulls":21},{"$f":"SUM(D3:K3)","v":0},null,"AF",null,null,"AC",2,"Accommodation & Hotels (Direct)","TA"]
["AA","Audio Visual Equipment, incl video conferencing, Televisions, Videos, sound recorders",{"$f":"MAX(D4:K4)","v":3},2,2,3,2,2,3,3,3,{"$f":"MAX(M4:N4)","v":2},2,1,2,{"$f":"MAX(Q4:R4)","v":3},3,3,{"$f":"MAX(T4:V4)","v":3},3,1,3,{"$f":"SUM(D4:K4,M4:O4,Q4:R4,T4:V4)","v":38},{"$f":"SUM(D4:K4)","v":20},null,"AG","Audio Visual Equipment, incl video conferencing, Televisions, Videos, sound recorders",null,"AD",2,"Accountancy Services, inc. Audit Consultancy,","RD"]
["AC","Audio Visual Learning and Training  Packs and Pre-recorded  Media",2,1,1,2,"N/A",2,1,0,1,2,1,2,2,1,1,1,{"$f":"MAX(T5:V5)","v":2},1,1,2,19,8,null,"AH","Audio Visual Learning and Training  Packs and Pre-recorded  Media",null,"AE",2,"Advertising Services  (Course, Recruitment & Other)","RA"]
["AD","Musical Instruments, Purchase, Maintenance and Hire",2,1,1,1,1,1,1,1,2,2,1,2,2,2,2,2,1,1,1,0,20,9,null,"AJ","Musical Instruments, Purchase, Maintenance and Hire",null,"AF",2,"Agric/Hortic Disposal Services","YG"]
["AE","Photographic Equipment Supplies and Services",3,2,2,2,2,1,3,1,3,3,3,2,2,2,2,2,3,3,1,2,33,16,null,"AL","Photographic Equipment Supplies and Services",null,"AG",2,"Agricultural Equipment Hire","EG"]
["AF","Studio Hire and Running  Costs",2,1,0,0,0,0,0,1,2,3,3,2,2,2,2,2,1,1,1,0,17,4,null,"AT","Studio Hire and Running  Costs",null,"AH",2,"Agricultural Equipment Maintenance and Repair","EF"]
["AG","Theatre Production Costs (scenery, lighting, props, costumes)",3,2,2,1,2,0,1,3,2,1,1,1,2,3,3,2,2,2,1,0,25,13,null,"AU","Theatre Production Costs (scenery, lighting, props, costumes)",null,"AJ",2,"Agricultural Fencing Supplies and Associated Services","EL"]
["AH","Video Equipment Purchase hire and Maintenance and repair ",3,2,2,1,2,2,3,3,2,2,1,2,2,2,2,1,3,3,1,1,30,17,null,"BA","Video Equipment Purchase hire and Maintenance and repair ",null,"AL",2,"Agricultural, Fisheries, Forestry, Oceanographic Capital Equipment >£10k ","EC"]
["AJ","Audio Visual Consumables,  Accessories, Cassettes  etc",2,2,2,0,1,1,1,1,2,2,1,2,2,3,3,2,3,3,1,0,24,10,null,"BB","Audio Visual Consumables,  Accessories, Cassettes  etc",null,"AT",2,"Agricultural, Fisheries, Forestry, Oceanographic, Small Equipment and Tools","ED"]
["AL","Digital Imaging Equipment  Purchase, Maintenance,  Repair and Consumables",3,2,2,2,1,2,3,2,2,2,1,2,2,2,2,2,3,3,1,2,31,16,null,"BC","Digital Imaging Equipment  Purchase, Maintenance,  Repair and Consumables",null,"AU",2,"Agricultural/Fisheries/Forestry/Horticultural/Oceanographic Supplies & Services","E"]
["AT","Audio-Visual Equipment Hire",3,1,1,1,0,1,1,3,2,2,1,2,2,3,3,2,3,3,1,2,26,10,null,"BD","Audio-Visual Equipment Hire",{"$nulls":3},"Air Travel","TB"]
["AU","Audio Visual Equipment Maintenance and Services",3,1,1,1,0,1,1,3,2,2,1,2,2,3,3,2,3,3,1,3,27,10,null,"BE","Audio Visual Equipment Maintenance and Services",{"$nulls":3},"Aircraft & Helicopter Hire","TN"]
["AZ","Other and General Audio-Visual  Aids",2,{"v":1.636363636,"d":"2"},1,1,1,1,2,{"v":1.818181818,"d":"2"},2,2,1,2,2,2,2,2,2,2,2,0,{"v":24.454545453999998,"d":"24"},{"v":11.454545454,"d":"11"},null,"BF","Other and General Audio-Visual  Aids",null,"BA",1,"Alarms (including Fire, Smoke, Gas, Intruder) purchase, maintenance, repair and hire","UM"]
{"$rows_left_out":319}
{"sheet":"Mapping Tool Data High Level","index":4,"n_rows":333,"n_cols":32,"rows_kept":333}
[1,2,3,4,5,6,7,8,9,10,11,null,12,14,17,null,15,16,{"$nulls":7},"AC",{"$nulls":5},"Supply Chain Code of Conduct Principle:"]
["Com Code","Commodity Code Description","Environmental Sustainability MAX","Carbon/ Climate Change ","Biodiversity "," Water ","Novel entities ","Material scarcity & security ","Waste/ Disposal ","Circular Economy Opportunities","Environmental Data Maturity Opportunities"," Social Compliance MAX"," Equality "," Modern Slavery Risk ","Social Opportunities (local)","Working Environment and Terms MAX","Wages and Terms","Health and Safety","Ethical Compliance & Economic Development MAX","Bribery & Corruption ","GDPR ","Cyber Security ","Sum",null,null,"AD",{"$nulls":4},"Commodity Code Description","Com Code"]
["A","Audio-Visual & Multimedia Supplies and Services",{"$nulls":21},{"$f":"SUM(D3:K3)","v":0},null,"AF",null,null,"AC",2,"Accommodation & Hotels (Direct)","TA"]
["AA","Audio Visual Equipment, incl video conferencing, Televisions, Videos, sound recorders",{"$f":"MAX(D4:K4)","v":3},2,2,3,2,2,3,3,3,{"$f":"MAX(M4:N4)","v":2},2,1,2,{"$f":"MAX(Q4:R4)","v":3},3,3,{"$f":"MAX(T4:V4)","v":3},3,1,3,{"$f":"SUM(D4:K4,M4:O4,Q4:R4,T4:V4)","v":38},{"$f":"SUM(D4:K4)","v":20},null,"AG","Audio Visual Equipment, incl video conferencing, Televisions, Videos, sound recorders",null,"AD",2,"Accountancy Services, inc. Audit Consultancy,","RD"]
["AC","Audio Visual Learning and Training  Packs and Pre-recorded  Media",2,1,1,2,"N/A",2,1,0,1,2,1,2,2,1,1,1,{"$f":"MAX(T5:V5)","v":2},1,1,2,19,8,null,"AH","Audio Visual Learning and Training  Packs and Pre-recorded  Media",null,"AE",2,"Advertising Services  (Course, Recruitment & Other)","RA"]
["AD","Musical Instruments, Purchase, Maintenance and Hire",2,1,1,1,1,1,1,1,2,2,1,2,2,2,2,2,1,1,1,0,20,9,null,"AJ","Musical Instruments, Purchase, Maintenance and Hire",null,"AF",2,"Agric/Hortic Disposal Services","YG"]
["AE","Photographic Equipment Supplies and Services",3,2,2,2,2,1,3,1,3,3,3,2,2,2,2,2,3,3,1,2,33,16,null,"AL","Photographic Equipment Supplies and Services",null,"AG",2,"Agricultural Equipment Hire","EG"]
["AF","Studio Hire and Running  Costs",2,1,0,0,0,0,0,1,2,3,3,2,2,2,2,2,1,1,1,0,17,4,null,"AT","Studio Hire and Running  Costs",null,"AH",2,"Agricultural Equipment Maintenance and Repair","EF"]
["AG","Theatre Production Costs (scenery, lighting, props, costumes)",3,2,2,1,2,0,1,3,2,1,1,1,2,3,3,2,2,2,1,0,25,13,null,"AU","Theatre Production Costs (scenery, lighting, props, costumes)",null,"AJ",2,"Agricultural Fencing Supplies and Associated Services","EL"]
["AH","Video Equipment Purchase hire and Maintenance and repair ",3,2,2,1,2,2,3,3,2,2,1,2,2,2,2,1,3,3,1,1,30,17,null,"BA","Video Equipment Purchase hire and Maintenance and repair ",null,"AL",2,"Agricultural, Fisheries, Forestry, Oceanographic Capital Equipment >£10k ","EC"]
["AJ","Audio Visual Consumables,  Accessories, Cassettes  etc",2,2,2,0,1,1,1,1,2,2,1,2,2,3,3,2,3,3,1,0,24,10,null,"BB","Audio Visual Consumables,  Accessories, Cassettes  etc",null,"AT",2,"Agricultural, Fisheries, Forestry, Oceanographic, Small Equipment and Tools","ED"]
["AL","Digital Imaging Equipment  Purchase, Maintenance,  Repair and Consumables",3,2,2,2,1,2,3,2,2,2,1,2,2,2,2,2,3,3,1,2,31,16,null,"BC","Digital Imaging Equipment  Purchase, Maintenance,  Repair and Consumables",null,"AU",2,"Agricultural/Fisheries/Forestry/Horticultural/Oceanographic Supplies & Services","E"]
["AT","Audio-Visual Equipment Hire",3,1,1,1,0,1,1,3,2,2,1,2,2,3,3,2,3,3,1,2,26,10,null,"BD","Audio-Visual Equipment Hire",{"$nulls":3},"Air Travel","TB"]
["AU","Audio Visual Equipment Maintenance and Services",3,1,1,1,0,1,1,3,2,2,1,2,2,3,3,2,3,3,1,3,27,10,null,"BE","Audio Visual Equipment Maintenance and Services",{"$nulls":3},"Aircraft & Helicopter Hire","TN"]
["AZ","Other and General Audio-Visual  Aids",2,{"v":1.636363636,"d":"2"},1,1,1,1,2,{"v":1.818181818,"d":"2"},2,2,1,2,2,2,2,2,2,2,2,0,{"v":24.454545453999998,"d":"24"},{"v":11.454545454,"d":"11"},null,"BF","Other and General Audio-Visual  Aids",null,"BA",1,"Alarms (including Fire, Smoke, Gas, Intruder) purchase, maintenance, repair and hire","UM"]
{"$rows_left_out":319}
{"sheet":"Factors & Assumptions","index":5,"n_rows":21,"n_cols":3,"rows_kept":21,"merged":[[2,2,9,2]]}
[null,"Factors Taken into Consideration in Classification","Approach/Assumptions"]
["Environmental Sustainability "]
["Carbon/ Climate Change ","▪Impacts of Production\n▪Impacts of transportation\n▪Impacts of product use/ service delivery","Step 1:\tConsider the key materials that make up the commodity (or are required to deliver the service).\n\nStep 2:\tConsider the impact on the sustainability theme across the lifecycle, up to \"in use\" phase (as waste / CE are included as thematic areas).\n\nStep 3:\tAllocate risk based on the most likely scenario for how these goods are produced & transported to the end user (could also be the worst case scenario).\nN/A used where there isn't suitable research on the topic at present."]
["Biodiversity ","▪Land/sea use change\n▪Habitat loss, fragmentation, destruction\n▪Species loss/collapse & Invasive species\n▪Over harvesting, over fishing, over hunting"]
["Water ","▪Water use \n▪Water pollution"]
["Novel entities ","“Things created and introduced into the environment by human beings that could have disruptive effects on the earth system” (Environmental Law Institute)\n▪Synthetic organic pollutants e.g. microplastics, endocrine disruptors, organic pollutants\n▪Radioactive materials e.g. nuclear waste, nuclear weapons\n▪Genetically modified organisms, \n▪Nanomaterials\n▪Micro-plastics."]
["Material Scarcity & Security ","▪ Finite or renewable resource\n▪Current geopolitical tensions\n▪ Anticipated future geopolitical tensions \n▪  Vulnerability of supply chain (i.e. reliant on materials from a small number of sources)\n▪ Transportation vulnerability (i.e. long supply lines, including pinch-points such as Straits of Hormuz, Straits of Malacca, Suez Canal, Panama Canal or other areas where a localised problem could have global consequences)\""]
["Waste/ Disposal ","▪Legislative requirements\n▪End of life reuasbility/ recyclability/ disposal\n▪Packaging materials and volume\n▪Consumption and production"]
["Circular Economy Opportunities","▪known Circular Initiatives within the sectors associated to this product\n▪known Circular Initiatives that could be transferred to the product (e.g. packaging used in a similar product)\n▪Expected inovation within the sectors associated to the product that are being discussed as viable."]
["Environmental Data Maturity Opportunities","▪Legislative requirements\n▪What opportunities are available to improve environmental data \n▪What benefits would improved environmental data provide"]
["Social Compliance "]
["Equality ","No discrimination on the grounds of education, social class/caste, nationality, trade union membership, age, disability, gender reassignment, marriage and civil partnership, pregnancy and maternity, race, culture, religion or belief, sex, or sexual orientation.","Known or perceived inequalities within sectoral supply chains."]
["Modern Slavery Risk ","▪Forced labour\n▪Child labour\n▪Human trafficking\n▪Bonded labour\n▪Servitude\n▪Criminal exploitation\n▪Compliance with modern slavery legislation","3= Product/service has risk of modern slavery within a tier of the supply chain based on the below considerations.\n\n2= Product/service has the potential for a risk of modern slavery within a tier of the supply chain based on the below considerations.\n\nIndustry/ Commodity risk (Agriculture, Mining, Logging, Fishing and fisheries, Construction, Manufacturing and electronics, Garment/ textile production, including footwear, Food processing, Services (including the hospitality, security services, cleaning and catering), Logistics, including warehousing, transport; Healthcare, social care. Workforce risk (Reliance upon low-skilled or unskilled labour, typically work that is low-paying, High numbers of temporary, seasonal, or agency workers, High level of subcontracting, Dangerous or physically demanding work, Isolation of workers due to working in rural locations, being home-based or in unmonitored and unregulated environments, absence of grievance mechanisms for workers and rights to freedom of association. Location risk see the United States' Bureau of International Labor Affairs (ILAB) List of Goods Produced by Child Labor or Forced Labor and  Global Slavery Index."]
["Social Opportunities (Local)","▪Sectors are known for delivering social opportunities\n▪Sectors require local workforce to deliver their goods or services\n▪Workforces where FHE courses are available to suppliment these vocations\nSectors with local manufacturing or distribution","Step 1: Consider the key goods or services that make up the commodity (or are required to deliver the service) and any potenial opportunities\n\nStep 2: Consider the impact on the social opportunities across the contract\n\nStep 3: Allocate score based on potential for suppliers to deliver community benifits locally. "]
["Working Environment and Terms "]
{"$rows_left_out":6}